{"text_format":"1","workbook":"xlsx","n_sheets":2,"sheets":["Main","MST"],"not_rendered":{"charts":0,"images":0,"macros":1,"external_links":0,"defined_names":1,"comments":0,"pivot_tables":0},"unopened":[],"bounds":{"document_bytes":16777216,"sheet_cells":100000,"rows_first":2000,"rows_last":500,"rows_between":2000,"halvings":0,"cell_chars":16384,"cell_head_chars":4096},"cells_cut":0,"cells_raw":0,"read":"whole","date_system":"1900"}

{"sheet":"Main","index":0,"n_rows":111,"n_cols":38,"rows_kept":111,"cut":false,"hidden":false,"merged":[]}
[null,"全回数",{"$f":"COUNTA(B11:B111)","v":0},null,null,null,null,null,null,null,null,null,null,null,null,null,null,null,null,null,null,null,null,null,null,null,null,null,{"$f":"IF(NOW()>MST!AA1,\"\",COUNTA(B11:B111)+ROW(A10))","v":10}]
[]
[null,"累計/全数",{"$f":"IF($C$1=0,0,C4/$C$1)","v":0},0,0,0,0,0,0,0,0,0,0,0]
[null,"累計",{"$f":"COUNTIF(C11:C111,\"~*\")","v":0},0,0,0,{"$f":"COUNTIF(G11:G111,\"~*\")","v":0},0,0,0,0,0,0,0]
[null,"最新連続数",{"$f":"COUNTIF(AC11:AC111,\"~*\")","v":0},{"$f":"COUNTIF(AD11:AD111,\"~*\")","v":0},{"$f":"COUNTIF(AE11:AE111,\"~*\")","v":0},{"$f":"COUNTIF(AF11:AF111,\"~*\")","v":0},{"$f":"COUNTIF(AG11:AG111,\"~*\")","v":0},0,{"$f":"COUNTIF(AG11:AG111,\"~*\")","v":0},0,0,0,0,0,"←最新が*だったら連続数を計算"]
[]
[]
[]
[]
["＃","数字","赤","黒","1to18","19to36","奇数","偶数","1to12","13to24","25to36","A","A+1","A+2",null,null,null,null,null,null,null,null,null,null,null,null,null,null,{"$f":"C10","v":"赤"},{"$f":"D10","v":"黒"},{"$f":"E10","v":"1to18"},{"$f":"F10","v":"19to36"},{"$f":"I10","v":"1to12"},"13to24","25to36","A","A+1",{"$f":"N10","v":"A+2"}]
[{"$f":"IF(B11=\"\",\"\",ROW()-10)","v":""},null,{"$f":"IF(OR(NOW()>MST!$AA$1,$B11=\"\"),\"\",IF(VLOOKUP($B11,MST!$A:$B,2,FALSE)=C$10,\"*\",\"\"))","v":""},{"$f":"IF(OR(NOW()>MST!$AA$1,$B11=\"\"),\"\",IF(VLOOKUP($B11,MST!$A:$B,2,FALSE)=D$10,\"*\",\"\"))","v":""},{"$f":"IF(OR(NOW()>MST!$AA$1,$B11=\"\"),\"\",IF(AND($B11>=1,$B11<=18),\"*\",\"\"))","v":""},{"$f":"IF(OR(NOW()>MST!$AA$1,$B11=\"\"),\"\",IF(AND($B11>=19,$B11<=36),\"*\",\"\"))","v":""},{"$f":"IF(OR(NOW()>MST!$AA$1,$B11=\"\"),\"\",IF(MOD($B11,2)=1,\"*\",\"\"))","v":""},{"$f":"IF(OR(NOW()>MST!$AA$1,$B11=\"\"),\"\",IF(MOD($B11,2)=0,\"*\",\"\"))","v":""},{"$f":"IF(OR(NOW()>MST!$AA$1,$B11=\"\"),\"\",IF(AND($B11>=1,$B11<=12),\"*\",\"\"))","v":""},{"$f":"IF(OR(NOW()>MST!$AA$1,$B11=\"\"),\"\",IF(AND($B11>=13,$B11<=24),\"*\",\"\"))","v":""},{"$f":"IF(OR(NOW()>MST!$AA$1,$B11=\"\"),\"\",IF(AND($B11>=25,$B11<=36),\"*\",\"\"))","v":""},{"$f":"IF(OR(NOW()>MST!$AA$1,$B11=\"\"),\"\",IF(MOD($B11,3)=0,\"*\",\"\"))","v":""},{"$f":"IF(OR(NOW()>MST!$AA$1,$B11=\"\"),\"\",IF(MOD($B11,3)=1,\"*\",\"\"))","v":""},{"$f":"IF(OR(NOW()>MST!$AA$1,$B11=\"\"),\"\",IF(MOD($B11,3)=2,\"*\",\"\"))","v":""},null,null,null,null,null,null,null,null,null,null,null,null,null,null,{"$f":"IF(ROW()=$AC$1,IF(C11=\"*\",C11,\"\"),IF(ROW()<$AC$1,IF(AND(AC12=\"*\",C11=\"*\"),AC12,\"\"),\"\"))","v":""},{"$f":"IF(ROW()=$AC$1,IF(D11=\"*\",D11,\"\"),IF(ROW()<$AC$1,IF(AND(AD12=\"*\",D11=\"*\"),AD12,\"\"),\"\"))","v":""},{"$f":"IF(ROW()=$AC$1,IF(E11=\"*\",E11,\"\"),IF(ROW()<$AC$1,IF(AND(AE12=\"*\",E11=\"*\"),AE12,\"\"),\"\"))","v":""},{"$f":"IF(ROW()=$AC$1,IF(F11=\"*\",F11,\"\"),IF(ROW()<$AC$1,IF(AND(AF12=\"*\",F11=\"*\"),AF12,\"\"),\"\"))","v":""},{"$f":"IF(ROW()=$AC$1,IF(I11=\"*\",I11,\"\"),IF(ROW()<$AC$1,IF(AND(AG12=\"*\",I11=\"*\"),AG12,\"\"),\"\"))","v":""},{"$f":"IF(ROW()=$AC$1,IF(J11=\"*\",J11,\"\"),IF(ROW()<$AC$1,IF(AND(AH12=\"*\",J11=\"*\"),AH12,\"\"),\"\"))","v":""},{"$f":"IF(ROW()=$AC$1,IF(K11=\"*\",K11,\"\"),IF(ROW()<$AC$1,IF(AND(AI12=\"*\",K11=\"*\"),AI12,\"\"),\"\"))","v":""},{"$f":"IF(ROW()=$AC$1,IF(L11=\"*\",L11,\"\"),IF(ROW()<$AC$1,IF(AND(AJ12=\"*\",L11=\"*\"),AJ12,\"\"),\"\"))","v":""},{"$f":"IF(ROW()=$AC$1,IF(M11=\"*\",M11,\"\"),IF(ROW()<$AC$1,IF(AND(AK12=\"*\",M11=\"*\"),AK12,\"\"),\"\"))","v":""},{"$f":"IF(ROW()=$AC$1,IF(N11=\"*\",N11,\"\"),IF(ROW()<$AC$1,IF(AND(AL12=\"*\",N11=\"*\"),AL12,\"\"),\"\"))","v":""}]
[{"$f":"IF(B12=\"\",\"\",ROW()-10)","v":""},null,{"$f":"IF(OR(NOW()>MST!$AA$1,$B12=\"\"),\"\",IF(VLOOKUP($B12,MST!$A:$B,2,FALSE)=C$10,\"*\",\"\"))","v":""},{"$f":"IF(OR(NOW()>MST!$AA$1,$B12=\"\"),\"\",IF(VLOOKUP($B12,MST!$A:$B,2,FALSE)=D$10,\"*\",\"\"))","v":""},{"$f":"IF(OR(NOW()>MST!$AA$1,$B12=\"\"),\"\",IF(AND($B12>=1,$B12<=18),\"*\",\"\"))","v":""},{"$f":"IF(OR(NOW()>MST!$AA$1,$B12=\"\"),\"\",IF(AND($B12>=19,$B12<=36),\"*\",\"\"))","v":""},{"$f":"IF(OR(NOW()>MST!$AA$1,$B12=\"\"),\"\",IF(MOD($B12,2)=1,\"*\",\"\"))","v":""},{"$f":"IF(OR(NOW()>MST!$AA$1,$B12=\"\"),\"\",IF(MOD($B12,2)=0,\"*\",\"\"))","v":""},{"$f":"IF(OR(NOW()>MST!$AA$1,$B12=\"\"),\"\",IF(AND($B12>=1,$B12<=12),\"*\",\"\"))","v":""},{"$f":"IF(OR(NOW()>MST!$AA$1,$B12=\"\"),\"\",IF(AND($B12>=13,$B12<=24),\"*\",\"\"))","v":""},{"$f":"IF(OR(NOW()>MST!$AA$1,$B12=\"\"),\"\",IF(AND($B12>=25,$B12<=36),\"*\",\"\"))","v":""},{"$f":"IF(OR(NOW()>MST!$AA$1,$B12=\"\"),\"\",IF(MOD($B12,3)=0,\"*\",\"\"))","v":""},{"$f":"IF(OR(NOW()>MST!$AA$1,$B12=\"\"),\"\",IF(MOD($B12,3)=1,\"*\",\"\"))","v":""},{"$f":"IF(OR(NOW()>MST!$AA$1,$B12=\"\"),\"\",IF(MOD($B12,3)=2,\"*\",\"\"))","v":""},null,null,null,null,null,null,null,null,null,null,null,null,null,null,{"$f":"IF(ROW()=$AC$1,IF(C12=\"*\",C12,\"\"),IF(ROW()<$AC$1,IF(AND(AC13=\"*\",C12=\"*\"),AC13,\"\"),\"\"))","v":""},{"$f":"IF(ROW()=$AC$1,IF(D12=\"*\",D12,\"\"),IF(ROW()<$AC$1,IF(AND(AD13=\"*\",D12=\"*\"),AD13,\"\"),\"\"))","v":""},{"$f":"IF(ROW()=$AC$1,IF(E12=\"*\",E12,\"\"),IF(ROW()<$AC$1,IF(AND(AE13=\"*\",E12=\"*\"),AE13,\"\"),\"\"))","v":""},{"$f":"IF(ROW()=$AC$1,IF(F12=\"*\",F12,\"\"),IF(ROW()<$AC$1,IF(AND(AF13=\"*\",F12=\"*\"),AF13,\"\"),\"\"))","v":""},{"$f":"IF(ROW()=$AC$1,IF(I12=\"*\",I12,\"\"),IF(ROW()<$AC$1,IF(AND(AG13=\"*\",I12=\"*\"),AG13,\"\"),\"\"))","v":""},{"$f":"IF(ROW()=$AC$1,IF(J12=\"*\",J12,\"\"),IF(ROW()<$AC$1,IF(AND(AH13=\"*\",J12=\"*\"),AH13,\"\"),\"\"))","v":""},{"$f":"IF(ROW()=$AC$1,IF(K12=\"*\",K12,\"\"),IF(ROW()<$AC$1,IF(AND(AI13=\"*\",K12=\"*\"),AI13,\"\"),\"\"))","v":""},{"$f":"IF(ROW()=$AC$1,IF(L12=\"*\",L12,\"\"),IF(ROW()<$AC$1,IF(AND(AJ13=\"*\",L12=\"*\"),AJ13,\"\"),\"\"))","v":""},{"$f":"IF(ROW()=$AC$1,IF(M12=\"*\",M12,\"\"),IF(ROW()<$AC$1,IF(AND(AK13=\"*\",M12=\"*\"),AK13,\"\"),\"\"))","v":""},{"$f":"IF(ROW()=$AC$1,IF(N12=\"*\",N12,\"\"),IF(ROW()<$AC$1,IF(AND(AL13=\"*\",N12=\"*\"),AL13,\"\"),\"\"))","v":""}]
[{"$f":"IF(B13=\"\",\"\",ROW()-10)","v":""},null,{"$f":"IF(OR(NOW()>MST!$AA$1,$B13=\"\"),\"\",IF(VLOOKUP($B13,MST!$A:$B,2,FALSE)=C$10,\"*\",\"\"))","v":""},{"$f":"IF(OR(NOW()>MST!$AA$1,$B13=\"\"),\"\",IF(VLOOKUP($B13,MST!$A:$B,2,FALSE)=D$10,\"*\",\"\"))","v":""},{"$f":"IF(OR(NOW()>MST!$AA$1,$B13=\"\"),\"\",IF(AND($B13>=1,$B13<=18),\"*\",\"\"))","v":""},{"$f":"IF(OR(NOW()>MST!$AA$1,$B13=\"\"),\"\",IF(AND($B13>=19,$B13<=36),\"*\",\"\"))","v":""},{"$f":"IF(OR(NOW()>MST!$AA$1,$B13=\"\"),\"\",IF(MOD($B13,2)=1,\"*\",\"\"))","v":""},{"$f":"IF(OR(NOW()>MST!$AA$1,$B13=\"\"),\"\",IF(MOD($B13,2)=0,\"*\",\"\"))","v":""},{"$f":"IF(OR(NOW()>MST!$AA$1,$B13=\"\"),\"\",IF(AND($B13>=1,$B13<=12),\"*\",\"\"))","v":""},{"$f":"IF(OR(NOW()>MST!$AA$1,$B13=\"\"),\"\",IF(AND($B13>=13,$B13<=24),\"*\",\"\"))","v":""},{"$f":"IF(OR(NOW()>MST!$AA$1,$B13=\"\"),\"\",IF(AND($B13>=25,$B13<=36),\"*\",\"\"))","v":""},{"$f":"IF(OR(NOW()>MST!$AA$1,$B13=\"\"),\"\",IF(MOD($B13,3)=0,\"*\",\"\"))","v":""},{"$f":"IF(OR(NOW()>MST!$AA$1,$B13=\"\"),\"\",IF(MOD($B13,3)=1,\"*\",\"\"))","v":""},{"$f":"IF(OR(NOW()>MST!$AA$1,$B13=\"\"),\"\",IF(MOD($B13,3)=2,\"*\",\"\"))","v":""},null,null,null,null,null,null,null,null,null,null,null,null,null,null,"",{"$f":"IF(ROW()=$AC$1,IF(D13=\"*\",D13,\"\"),IF(ROW()<$AC$1,IF(AND(AD14=\"*\",D13=\"*\"),AD14,\"\"),\"\"))","v":""},{"$f":"IF(ROW()=$AC$1,IF(E13=\"*\",E13,\"\"),IF(ROW()<$AC$1,IF(AND(AE14=\"*\",E13=\"*\"),AE14,\"\"),\"\"))","v":""},{"$f":"IF(ROW()=$AC$1,IF(F13=\"*\",F13,\"\"),IF(ROW()<$AC$1,IF(AND(AF14=\"*\",F13=\"*\"),AF14,\"\"),\"\"))","v":""},{"$f":"IF(ROW()=$AC$1,IF(I13=\"*\",I13,\"\"),IF(ROW()<$AC$1,IF(AND(AG14=\"*\",I13=\"*\"),AG14,\"\"),\"\"))","v":""},{"$f":"IF(ROW()=$AC$1,IF(J13=\"*\",J13,\"\"),IF(ROW()<$AC$1,IF(AND(AH14=\"*\",J13=\"*\"),AH14,\"\"),\"\"))","v":""},{"$f":"IF(ROW()=$AC$1,IF(K13=\"*\",K13,\"\"),IF(ROW()<$AC$1,IF(AND(AI14=\"*\",K13=\"*\"),AI14,\"\"),\"\"))","v":""},{"$f":"IF(ROW()=$AC$1,IF(L13=\"*\",L13,\"\"),IF(ROW()<$AC$1,IF(AND(AJ14=\"*\",L13=\"*\"),AJ14,\"\"),\"\"))","v":""},{"$f":"IF(ROW()=$AC$1,IF(M13=\"*\",M13,\"\"),IF(ROW()<$AC$1,IF(AND(AK14=\"*\",M13=\"*\"),AK14,\"\"),\"\"))","v":""},{"$f":"IF(ROW()=$AC$1,IF(N13=\"*\",N13,\"\"),IF(ROW()<$AC$1,IF(AND(AL14=\"*\",N13=\"*\"),AL14,\"\"),\"\"))","v":""}]
["",null,{"$f":"IF(OR(NOW()>MST!$AA$1,$B14=\"\"),\"\",IF(VLOOKUP($B14,MST!$A:$B,2,FALSE)=C$10,\"*\",\"\"))","v":""},{"$f":"IF(OR(NOW()>MST!$AA$1,$B14=\"\"),\"\",IF(VLOOKUP($B14,MST!$A:$B,2,FALSE)=D$10,\"*\",\"\"))","v":""},{"$f":"IF(OR(NOW()>MST!$AA$1,$B14=\"\"),\"\",IF(AND($B14>=1,$B14<=18),\"*\",\"\"))","v":""},{"$f":"IF(OR(NOW()>MST!$AA$1,$B14=\"\"),\"\",IF(AND($B14>=19,$B14<=36),\"*\",\"\"))","v":""},{"$f":"IF(OR(NOW()>MST!$AA$1,$B14=\"\"),\"\",IF(MOD($B14,2)=1,\"*\",\"\"))","v":""},{"$f":"IF(OR(NOW()>MST!$AA$1,$B14=\"\"),\"\",IF(MOD($B14,2)=0,\"*\",\"\"))","v":""},{"$f":"IF(OR(NOW()>MST!$AA$1,$B14=\"\"),\"\",IF(AND($B14>=1,$B14<=12),\"*\",\"\"))","v":""},{"$f":"IF(OR(NOW()>MST!$AA$1,$B14=\"\"),\"\",IF(AND($B14>=13,$B14<=24),\"*\",\"\"))","v":""},{"$f":"IF(OR(NOW()>MST!$AA$1,$B14=\"\"),\"\",IF(AND($B14>=25,$B14<=36),\"*\",\"\"))","v":""},{"$f":"IF(OR(NOW()>MST!$AA$1,$B14=\"\"),\"\",IF(MOD($B14,3)=0,\"*\",\"\"))","v":""},{"$f":"IF(OR(NOW()>MST!$AA$1,$B14=\"\"),\"\",IF(MOD($B14,3)=1,\"*\",\"\"))","v":""},{"$f":"IF(OR(NOW()>MST!$AA$1,$B14=\"\"),\"\",IF(MOD($B14,3)=2,\"*\",\"\"))","v":""},null,null,null,null,null,null,null,null,null,null,null,null,null,null,"",{"$f":"IF(ROW()=$AC$1,IF(D14=\"*\",D14,\"\"),IF(ROW()<$AC$1,IF(AND(AD15=\"*\",D14=\"*\"),AD15,\"\"),\"\"))","v":""},{"$f":"IF(ROW()=$AC$1,IF(E14=\"*\",E14,\"\"),IF(ROW()<$AC$1,IF(AND(AE15=\"*\",E14=\"*\"),AE15,\"\"),\"\"))","v":""},{"$f":"IF(ROW()=$AC$1,IF(F14=\"*\",F14,\"\"),IF(ROW()<$AC$1,IF(AND(AF15=\"*\",F14=\"*\"),AF15,\"\"),\"\"))","v":""},{"$f":"IF(ROW()=$AC$1,IF(I14=\"*\",I14,\"\"),IF(ROW()<$AC$1,IF(AND(AG15=\"*\",I14=\"*\"),AG15,\"\"),\"\"))","v":""},{"$f":"IF(ROW()=$AC$1,IF(J14=\"*\",J14,\"\"),IF(ROW()<$AC$1,IF(AND(AH15=\"*\",J14=\"*\"),AH15,\"\"),\"\"))","v":""},{"$f":"IF(ROW()=$AC$1,IF(K14=\"*\",K14,\"\"),IF(ROW()<$AC$1,IF(AND(AI15=\"*\",K14=\"*\"),AI15,\"\"),\"\"))","v":""},{"$f":"IF(ROW()=$AC$1,IF(L14=\"*\",L14,\"\"),IF(ROW()<$AC$1,IF(AND(AJ15=\"*\",L14=\"*\"),AJ15,\"\"),\"\"))","v":""},{"$f":"IF(ROW()=$AC$1,IF(M14=\"*\",M14,\"\"),IF(ROW()<$AC$1,IF(AND(AK15=\"*\",M14=\"*\"),AK15,\"\"),\"\"))","v":""},{"$f":"IF(ROW()=$AC$1,IF(N14=\"*\",N14,\"\"),IF(ROW()<$AC$1,IF(AND(AL15=\"*\",N14=\"*\"),AL15,\"\"),\"\"))","v":""}]
["",null,{"$f":"IF(OR(NOW()>MST!$AA$1,$B15=\"\"),\"\",IF(VLOOKUP($B15,MST!$A:$B,2,FALSE)=C$10,\"*\",\"\"))","v":""},{"$f":"IF(OR(NOW()>MST!$AA$1,$B15=\"\"),\"\",IF(VLOOKUP($B15,MST!$A:$B,2,FALSE)=D$10,\"*\",\"\"))","v":""},{"$f":"IF(OR(NOW()>MST!$AA$1,$B15=\"\"),\"\",IF(AND($B15>=1,$B15<=18),\"*\",\"\"))","v":""},{"$f":"IF(OR(NOW()>MST!$AA$1,$B15=\"\"),\"\",IF(AND($B15>=19,$B15<=36),\"*\",\"\"))","v":""},{"$f":"IF(OR(NOW()>MST!$AA$1,$B15=\"\"),\"\",IF(MOD($B15,2)=1,\"*\",\"\"))","v":""},{"$f":"IF(OR(NOW()>MST!$AA$1,$B15=\"\"),\"\",IF(MOD($B15,2)=0,\"*\",\"\"))","v":""},{"$f":"IF(OR(NOW()>MST!$AA$1,$B15=\"\"),\"\",IF(AND($B15>=1,$B15<=12),\"*\",\"\"))","v":""},{"$f":"IF(OR(NOW()>MST!$AA$1,$B15=\"\"),\"\",IF(AND($B15>=13,$B15<=24),\"*\",\"\"))","v":""},{"$f":"IF(OR(NOW()>MST!$AA$1,$B15=\"\"),\"\",IF(AND($B15>=25,$B15<=36),\"*\",\"\"))","v":""},{"$f":"IF(OR(NOW()>MST!$AA$1,$B15=\"\"),\"\",IF(MOD($B15,3)=0,\"*\",\"\"))","v":""},{"$f":"IF(OR(NOW()>MST!$AA$1,$B15=\"\"),\"\",IF(MOD($B15,3)=1,\"*\",\"\"))","v":""},{"$f":"IF(OR(NOW()>MST!$AA$1,$B15=\"\"),\"\",IF(MOD($B15,3)=2,\"*\",\"\"))","v":""},null,null,null,null,null,null,null,null,null,null,null,null,null,null,"",{"$f":"IF(ROW()=$AC$1,IF(D15=\"*\",D15,\"\"),IF(ROW()<$AC$1,IF(AND(AD16=\"*\",D15=\"*\"),AD16,\"\"),\"\"))","v":""},{"$f":"IF(ROW()=$AC$1,IF(E15=\"*\",E15,\"\"),IF(ROW()<$AC$1,IF(AND(AE16=\"*\",E15=\"*\"),AE16,\"\"),\"\"))","v":""},{"$f":"IF(ROW()=$AC$1,IF(F15=\"*\",F15,\"\"),IF(ROW()<$AC$1,IF(AND(AF16=\"*\",F15=\"*\"),AF16,\"\"),\"\"))","v":""},{"$f":"IF(ROW()=$AC$1,IF(I15=\"*\",I15,\"\"),IF(ROW()<$AC$1,IF(AND(AG16=\"*\",I15=\"*\"),AG16,\"\"),\"\"))","v":""},{"$f":"IF(ROW()=$AC$1,IF(J15=\"*\",J15,\"\"),IF(ROW()<$AC$1,IF(AND(AH16=\"*\",J15=\"*\"),AH16,\"\"),\"\"))","v":""},{"$f":"IF(ROW()=$AC$1,IF(K15=\"*\",K15,\"\"),IF(ROW()<$AC$1,IF(AND(AI16=\"*\",K15=\"*\"),AI16,\"\"),\"\"))","v":""},{"$f":"IF(ROW()=$AC$1,IF(L15=\"*\",L15,\"\"),IF(ROW()<$AC$1,IF(AND(AJ16=\"*\",L15=\"*\"),AJ16,\"\"),\"\"))","v":""},{"$f":"IF(ROW()=$AC$1,IF(M15=\"*\",M15,\"\"),IF(ROW()<$AC$1,IF(AND(AK16=\"*\",M15=\"*\"),AK16,\"\"),\"\"))","v":""},{"$f":"IF(ROW()=$AC$1,IF(N15=\"*\",N15,\"\"),IF(ROW()<$AC$1,IF(AND(AL16=\"*\",N15=\"*\"),AL16,\"\"),\"\"))","v":""}]
["",null,{"$f":"IF(OR(NOW()>MST!$AA$1,$B16=\"\"),\"\",IF(VLOOKUP($B16,MST!$A:$B,2,FALSE)=C$10,\"*\",\"\"))","v":""},{"$f":"IF(OR(NOW()>MST!$AA$1,$B16=\"\"),\"\",IF(VLOOKUP($B16,MST!$A:$B,2,FALSE)=D$10,\"*\",\"\"))","v":""},{"$f":"IF(OR(NOW()>MST!$AA$1,$B16=\"\"),\"\",IF(AND($B16>=1,$B16<=18),\"*\",\"\"))","v":""},{"$f":"IF(OR(NOW()>MST!$AA$1,$B16=\"\"),\"\",IF(AND($B16>=19,$B16<=36),\"*\",\"\"))","v":""},{"$f":"IF(OR(NOW()>MST!$AA$1,$B16=\"\"),\"\",IF(MOD($B16,2)=1,\"*\",\"\"))","v":""},{"$f":"IF(OR(NOW()>MST!$AA$1,$B16=\"\"),\"\",IF(MOD($B16,2)=0,\"*\",\"\"))","v":""},{"$f":"IF(OR(NOW()>MST!$AA$1,$B16=\"\"),\"\",IF(AND($B16>=1,$B16<=12),\"*\",\"\"))","v":""},{"$f":"IF(OR(NOW()>MST!$AA$1,$B16=\"\"),\"\",IF(AND($B16>=13,$B16<=24),\"*\",\"\"))","v":""},{"$f":"IF(OR(NOW()>MST!$AA$1,$B16=\"\"),\"\",IF(AND($B16>=25,$B16<=36),\"*\",\"\"))","v":""},{"$f":"IF(OR(NOW()>MST!$AA$1,$B16=\"\"),\"\",IF(MOD($B16,3)=0,\"*\",\"\"))","v":""},{"$f":"IF(OR(NOW()>MST!$AA$1,$B16=\"\"),\"\",IF(MOD($B16,3)=1,\"*\",\"\"))","v":""},{"$f":"IF(OR(NOW()>MST!$AA$1,$B16=\"\"),\"\",IF(MOD($B16,3)=2,\"*\",\"\"))","v":""},null,null,null,null,null,null,null,null,null,null,null,null,null,null,"",{"$f":"IF(ROW()=$AC$1,IF(D16=\"*\",D16,\"\"),IF(ROW()<$AC$1,IF(AND(AD17=\"*\",D16=\"*\"),AD17,\"\"),\"\"))","v":""},{"$f":"IF(ROW()=$AC$1,IF(E16=\"*\",E16,\"\"),IF(ROW()<$AC$1,IF(AND(AE17=\"*\",E16=\"*\"),AE17,\"\"),\"\"))","v":""},{"$f":"IF(ROW()=$AC$1,IF(F16=\"*\",F16,\"\"),IF(ROW()<$AC$1,IF(AND(AF17=\"*\",F16=\"*\"),AF17,\"\"),\"\"))","v":""},{"$f":"IF(ROW()=$AC$1,IF(I16=\"*\",I16,\"\"),IF(ROW()<$AC$1,IF(AND(AG17=\"*\",I16=\"*\"),AG17,\"\"),\"\"))","v":""},{"$f":"IF(ROW()=$AC$1,IF(J16=\"*\",J16,\"\"),IF(ROW()<$AC$1,IF(AND(AH17=\"*\",J16=\"*\"),AH17,\"\"),\"\"))","v":""},{"$f":"IF(ROW()=$AC$1,IF(K16=\"*\",K16,\"\"),IF(ROW()<$AC$1,IF(AND(AI17=\"*\",K16=\"*\"),AI17,\"\"),\"\"))","v":""},{"$f":"IF(ROW()=$AC$1,IF(L16=\"*\",L16,\"\"),IF(ROW()<$AC$1,IF(AND(AJ17=\"*\",L16=\"*\"),AJ17,\"\"),\"\"))","v":""},{"$f":"IF(ROW()=$AC$1,IF(M16=\"*\",M16,\"\"),IF(ROW()<$AC$1,IF(AND(AK17=\"*\",M16=\"*\"),AK17,\"\"),\"\"))","v":""},{"$f":"IF(ROW()=$AC$1,IF(N16=\"*\",N16,\"\"),IF(ROW()<$AC$1,IF(AND(AL17=\"*\",N16=\"*\"),AL17,\"\"),\"\"))","v":""}]
["",null,{"$f":"IF(OR(NOW()>MST!$AA$1,$B17=\"\"),\"\",IF(VLOOKUP($B17,MST!$A:$B,2,FALSE)=C$10,\"*\",\"\"))","v":""},{"$f":"IF(OR(NOW()>MST!$AA$1,$B17=\"\"),\"\",IF(VLOOKUP($B17,MST!$A:$B,2,FALSE)=D$10,\"*\",\"\"))","v":""},{"$f":"IF(OR(NOW()>MST!$AA$1,$B17=\"\"),\"\",IF(AND($B17>=1,$B17<=18),\"*\",\"\"))","v":""},{"$f":"IF(OR(NOW()>MST!$AA$1,$B17=\"\"),\"\",IF(AND($B17>=19,$B17<=36),\"*\",\"\"))","v":""},{"$f":"IF(OR(NOW()>MST!$AA$1,$B17=\"\"),\"\",IF(MOD($B17,2)=1,\"*\",\"\"))","v":""},{"$f":"IF(OR(NOW()>MST!$AA$1,$B17=\"\"),\"\",IF(MOD($B17,2)=0,\"*\",\"\"))","v":""},{"$f":"IF(OR(NOW()>MST!$AA$1,$B17=\"\"),\"\",IF(AND($B17>=1,$B17<=12),\"*\",\"\"))","v":""},{"$f":"IF(OR(NOW()>MST!$AA$1,$B17=\"\"),\"\",IF(AND($B17>=13,$B17<=24),\"*\",\"\"))","v":""},{"$f":"IF(OR(NOW()>MST!$AA$1,$B17=\"\"),\"\",IF(AND($B17>=25,$B17<=36),\"*\",\"\"))","v":""},{"$f":"IF(OR(NOW()>MST!$AA$1,$B17=\"\"),\"\",IF(MOD($B17,3)=0,\"*\",\"\"))","v":""},{"$f":"IF(OR(NOW()>MST!$AA$1,$B17=\"\"),\"\",IF(MOD($B17,3)=1,\"*\",\"\"))","v":""},{"$f":"IF(OR(NOW()>MST!$AA$1,$B17=\"\"),\"\",IF(MOD($B17,3)=2,\"*\",\"\"))","v":""},null,null,null,null,null,null,null,null,null,null,null,null,null,null,"",{"$f":"IF(ROW()=$AC$1,IF(D17=\"*\",D17,\"\"),IF(ROW()<$AC$1,IF(AND(AD18=\"*\",D17=\"*\"),AD18,\"\"),\"\"))","v":""},{"$f":"IF(ROW()=$AC$1,IF(E17=\"*\",E17,\"\"),IF(ROW()<$AC$1,IF(AND(AE18=\"*\",E17=\"*\"),AE18,\"\"),\"\"))","v":""},{"$f":"IF(ROW()=$AC$1,IF(F17=\"*\",F17,\"\"),IF(ROW()<$AC$1,IF(AND(AF18=\"*\",F17=\"*\"),AF18,\"\"),\"\"))","v":""},{"$f":"IF(ROW()=$AC$1,IF(I17=\"*\",I17,\"\"),IF(ROW()<$AC$1,IF(AND(AG18=\"*\",I17=\"*\"),AG18,\"\"),\"\"))","v":""},{"$f":"IF(ROW()=$AC$1,IF(J17=\"*\",J17,\"\"),IF(ROW()<$AC$1,IF(AND(AH18=\"*\",J17=\"*\"),AH18,\"\"),\"\"))","v":""},{"$f":"IF(ROW()=$AC$1,IF(K17=\"*\",K17,\"\"),IF(ROW()<$AC$1,IF(AND(AI18=\"*\",K17=\"*\"),AI18,\"\"),\"\"))","v":""},{"$f":"IF(ROW()=$AC$1,IF(L17=\"*\",L17,\"\"),IF(ROW()<$AC$1,IF(AND(AJ18=\"*\",L17=\"*\"),AJ18,\"\"),\"\"))","v":""},{"$f":"IF(ROW()=$AC$1,IF(M17=\"*\",M17,\"\"),IF(ROW()<$AC$1,IF(AND(AK18=\"*\",M17=\"*\"),AK18,\"\"),\"\"))","v":""},{"$f":"IF(ROW()=$AC$1,IF(N17=\"*\",N17,\"\"),IF(ROW()<$AC$1,IF(AND(AL18=\"*\",N17=\"*\"),AL18,\"\"),\"\"))","v":""}]
["",null,{"$f":"IF(OR(NOW()>MST!$AA$1,$B18=\"\"),\"\",IF(VLOOKUP($B18,MST!$A:$B,2,FALSE)=C$10,\"*\",\"\"))","v":""},{"$f":"IF(OR(NOW()>MST!$AA$1,$B18=\"\"),\"\",IF(VLOOKUP($B18,MST!$A:$B,2,FALSE)=D$10,\"*\",\"\"))","v":""},{"$f":"IF(OR(NOW()>MST!$AA$1,$B18=\"\"),\"\",IF(AND($B18>=1,$B18<=18),\"*\",\"\"))","v":""},{"$f":"IF(OR(NOW()>MST!$AA$1,$B18=\"\"),\"\",IF(AND($B18>=19,$B18<=36),\"*\",\"\"))","v":""},{"$f":"IF(OR(NOW()>MST!$AA$1,$B18=\"\"),\"\",IF(MOD($B18,2)=1,\"*\",\"\"))","v":""},{"$f":"IF(OR(NOW()>MST!$AA$1,$B18=\"\"),\"\",IF(MOD($B18,2)=0,\"*\",\"\"))","v":""},{"$f":"IF(OR(NOW()>MST!$AA$1,$B18=\"\"),\"\",IF(AND($B18>=1,$B18<=12),\"*\",\"\"))","v":""},{"$f":"IF(OR(NOW()>MST!$AA$1,$B18=\"\"),\"\",IF(AND($B18>=13,$B18<=24),\"*\",\"\"))","v":""},{"$f":"IF(OR(NOW()>MST!$AA$1,$B18=\"\"),\"\",IF(AND($B18>=25,$B18<=36),\"*\",\"\"))","v":""},{"$f":"IF(OR(NOW()>MST!$AA$1,$B18=\"\"),\"\",IF(MOD($B18,3)=0,\"*\",\"\"))","v":""},{"$f":"IF(OR(NOW()>MST!$AA$1,$B18=\"\"),\"\",IF(MOD($B18,3)=1,\"*\",\"\"))","v":""},{"$f":"IF(OR(NOW()>MST!$AA$1,$B18=\"\"),\"\",IF(MOD($B18,3)=2,\"*\",\"\"))","v":""},null,null,null,null,null,null,null,null,null,null,null,null,null,null,"",{"$f":"IF(ROW()=$AC$1,IF(D18=\"*\",D18,\"\"),IF(ROW()<$AC$1,IF(AND(AD19=\"*\",D18=\"*\"),AD19,\"\"),\"\"))","v":""},{"$f":"IF(ROW()=$AC$1,IF(E18=\"*\",E18,\"\"),IF(ROW()<$AC$1,IF(AND(AE19=\"*\",E18=\"*\"),AE19,\"\"),\"\"))","v":""},{"$f":"IF(ROW()=$AC$1,IF(F18=\"*\",F18,\"\"),IF(ROW()<$AC$1,IF(AND(AF19=\"*\",F18=\"*\"),AF19,\"\"),\"\"))","v":""},{"$f":"IF(ROW()=$AC$1,IF(I18=\"*\",I18,\"\"),IF(ROW()<$AC$1,IF(AND(AG19=\"*\",I18=\"*\"),AG19,\"\"),\"\"))","v":""},{"$f":"IF(ROW()=$AC$1,IF(J18=\"*\",J18,\"\"),IF(ROW()<$AC$1,IF(AND(AH19=\"*\",J18=\"*\"),AH19,\"\"),\"\"))","v":""},{"$f":"IF(ROW()=$AC$1,IF(K18=\"*\",K18,\"\"),IF(ROW()<$AC$1,IF(AND(AI19=\"*\",K18=\"*\"),AI19,\"\"),\"\"))","v":""},{"$f":"IF(ROW()=$AC$1,IF(L18=\"*\",L18,\"\"),IF(ROW()<$AC$1,IF(AND(AJ19=\"*\",L18=\"*\"),AJ19,\"\"),\"\"))","v":""},{"$f":"IF(ROW()=$AC$1,IF(M18=\"*\",M18,\"\"),IF(ROW()<$AC$1,IF(AND(AK19=\"*\",M18=\"*\"),AK19,\"\"),\"\"))","v":""},{"$f":"IF(ROW()=$AC$1,IF(N18=\"*\",N18,\"\"),IF(ROW()<$AC$1,IF(AND(AL19=\"*\",N18=\"*\"),AL19,\"\"),\"\"))","v":""}]
["",null,{"$f":"IF(OR(NOW()>MST!$AA$1,$B19=\"\"),\"\",IF(VLOOKUP($B19,MST!$A:$B,2,FALSE)=C$10,\"*\",\"\"))","v":""},{"$f":"IF(OR(NOW()>MST!$AA$1,$B19=\"\"),\"\",IF(VLOOKUP($B19,MST!$A:$B,2,FALSE)=D$10,\"*\",\"\"))","v":""},{"$f":"IF(OR(NOW()>MST!$AA$1,$B19=\"\"),\"\",IF(AND($B19>=1,$B19<=18),\"*\",\"\"))","v":""},{"$f":"IF(OR(NOW()>MST!$AA$1,$B19=\"\"),\"\",IF(AND($B19>=19,$B19<=36),\"*\",\"\"))","v":""},{"$f":"IF(OR(NOW()>MST!$AA$1,$B19=\"\"),\"\",IF(MOD($B19,2)=1,\"*\",\"\"))","v":""},{"$f":"IF(OR(NOW()>MST!$AA$1,$B19=\"\"),\"\",IF(MOD($B19,2)=0,\"*\",\"\"))","v":""},{"$f":"IF(OR(NOW()>MST!$AA$1,$B19=\"\"),\"\",IF(AND($B19>=1,$B19<=12),\"*\",\"\"))","v":""},{"$f":"IF(OR(NOW()>MST!$AA$1,$B19=\"\"),\"\",IF(AND($B19>=13,$B19<=24),\"*\",\"\"))","v":""},{"$f":"IF(OR(NOW()>MST!$AA$1,$B19=\"\"),\"\",IF(AND($B19>=25,$B19<=36),\"*\",\"\"))","v":""},{"$f":"IF(OR(NOW()>MST!$AA$1,$B19=\"\"),\"\",IF(MOD($B19,3)=0,\"*\",\"\"))","v":""},{"$f":"IF(OR(NOW()>MST!$AA$1,$B19=\"\"),\"\",IF(MOD($B19,3)=1,\"*\",\"\"))","v":""},{"$f":"IF(OR(NOW()>MST!$AA$1,$B19=\"\"),\"\",IF(MOD($B19,3)=2,\"*\",\"\"))","v":""},null,null,null,null,null,null,null,null,null,null,null,null,null,null,"",{"$f":"IF(ROW()=$AC$1,IF(D19=\"*\",D19,\"\"),IF(ROW()<$AC$1,IF(AND(AD20=\"*\",D19=\"*\"),AD20,\"\"),\"\"))","v":""},{"$f":"IF(ROW()=$AC$1,IF(E19=\"*\",E19,\"\"),IF(ROW()<$AC$1,IF(AND(AE20=\"*\",E19=\"*\"),AE20,\"\"),\"\"))","v":""},{"$f":"IF(ROW()=$AC$1,IF(F19=\"*\",F19,\"\"),IF(ROW()<$AC$1,IF(AND(AF20=\"*\",F19=\"*\"),AF20,\"\"),\"\"))","v":""},{"$f":"IF(ROW()=$AC$1,IF(I19=\"*\",I19,\"\"),IF(ROW()<$AC$1,IF(AND(AG20=\"*\",I19=\"*\"),AG20,\"\"),\"\"))","v":""},{"$f":"IF(ROW()=$AC$1,IF(J19=\"*\",J19,\"\"),IF(ROW()<$AC$1,IF(AND(AH20=\"*\",J19=\"*\"),AH20,\"\"),\"\"))","v":""},{"$f":"IF(ROW()=$AC$1,IF(K19=\"*\",K19,\"\"),IF(ROW()<$AC$1,IF(AND(AI20=\"*\",K19=\"*\"),AI20,\"\"),\"\"))","v":""},{"$f":"IF(ROW()=$AC$1,IF(L19=\"*\",L19,\"\"),IF(ROW()<$AC$1,IF(AND(AJ20=\"*\",L19=\"*\"),AJ20,\"\"),\"\"))","v":""},{"$f":"IF(ROW()=$AC$1,IF(M19=\"*\",M19,\"\"),IF(ROW()<$AC$1,IF(AND(AK20=\"*\",M19=\"*\"),AK20,\"\"),\"\"))","v":""},{"$f":"IF(ROW()=$AC$1,IF(N19=\"*\",N19,\"\"),IF(ROW()<$AC$1,IF(AND(AL20=\"*\",N19=\"*\"),AL20,\"\"),\"\"))","v":""}]
["",null,{"$f":"IF(OR(NOW()>MST!$AA$1,$B20=\"\"),\"\",IF(VLOOKUP($B20,MST!$A:$B,2,FALSE)=C$10,\"*\",\"\"))","v":""},{"$f":"IF(OR(NOW()>MST!$AA$1,$B20=\"\"),\"\",IF(VLOOKUP($B20,MST!$A:$B,2,FALSE)=D$10,\"*\",\"\"))","v":""},{"$f":"IF(OR(NOW()>MST!$AA$1,$B20=\"\"),\"\",IF(AND($B20>=1,$B20<=18),\"*\",\"\"))","v":""},{"$f":"IF(OR(NOW()>MST!$AA$1,$B20=\"\"),\"\",IF(AND($B20>=19,$B20<=36),\"*\",\"\"))","v":""},{"$f":"IF(OR(NOW()>MST!$AA$1,$B20=\"\"),\"\",IF(MOD($B20,2)=1,\"*\",\"\"))","v":""},{"$f":"IF(OR(NOW()>MST!$AA$1,$B20=\"\"),\"\",IF(MOD($B20,2)=0,\"*\",\"\"))","v":""},{"$f":"IF(OR(NOW()>MST!$AA$1,$B20=\"\"),\"\",IF(AND($B20>=1,$B20<=12),\"*\",\"\"))","v":""},{"$f":"IF(OR(NOW()>MST!$AA$1,$B20=\"\"),\"\",IF(AND($B20>=13,$B20<=24),\"*\",\"\"))","v":""},{"$f":"IF(OR(NOW()>MST!$AA$1,$B20=\"\"),\"\",IF(AND($B20>=25,$B20<=36),\"*\",\"\"))","v":""},{"$f":"IF(OR(NOW()>MST!$AA$1,$B20=\"\"),\"\",IF(MOD($B20,3)=0,\"*\",\"\"))","v":""},{"$f":"IF(OR(NOW()>MST!$AA$1,$B20=\"\"),\"\",IF(MOD($B20,3)=1,\"*\",\"\"))","v":""},{"$f":"IF(OR(NOW()>MST!$AA$1,$B20=\"\"),\"\",IF(MOD($B20,3)=2,\"*\",\"\"))","v":""},null,null,null,null,null,null,null,null,null,null,null,null,null,null,"",{"$f":"IF(ROW()=$AC$1,IF(D20=\"*\",D20,\"\"),IF(ROW()<$AC$1,IF(AND(AD21=\"*\",D20=\"*\"),AD21,\"\"),\"\"))","v":""},{"$f":"IF(ROW()=$AC$1,IF(E20=\"*\",E20,\"\"),IF(ROW()<$AC$1,IF(AND(AE21=\"*\",E20=\"*\"),AE21,\"\"),\"\"))","v":""},{"$f":"IF(ROW()=$AC$1,IF(F20=\"*\",F20,\"\"),IF(ROW()<$AC$1,IF(AND(AF21=\"*\",F20=\"*\"),AF21,\"\"),\"\"))","v":""},{"$f":"IF(ROW()=$AC$1,IF(I20=\"*\",I20,\"\"),IF(ROW()<$AC$1,IF(AND(AG21=\"*\",I20=\"*\"),AG21,\"\"),\"\"))","v":""},{"$f":"IF(ROW()=$AC$1,IF(J20=\"*\",J20,\"\"),IF(ROW()<$AC$1,IF(AND(AH21=\"*\",J20=\"*\"),AH21,\"\"),\"\"))","v":""},{"$f":"IF(ROW()=$AC$1,IF(K20=\"*\",K20,\"\"),IF(ROW()<$AC$1,IF(AND(AI21=\"*\",K20=\"*\"),AI21,\"\"),\"\"))","v":""},{"$f":"IF(ROW()=$AC$1,IF(L20=\"*\",L20,\"\"),IF(ROW()<$AC$1,IF(AND(AJ21=\"*\",L20=\"*\"),AJ21,\"\"),\"\"))","v":""},{"$f":"IF(ROW()=$AC$1,IF(M20=\"*\",M20,\"\"),IF(ROW()<$AC$1,IF(AND(AK21=\"*\",M20=\"*\"),AK21,\"\"),\"\"))","v":""},{"$f":"IF(ROW()=$AC$1,IF(N20=\"*\",N20,\"\"),IF(ROW()<$AC$1,IF(AND(AL21=\"*\",N20=\"*\"),AL21,\"\"),\"\"))","v":""}]
{"$rows_left_out":92}
{"sheet":"MST","index":1,"n_rows":36,"n_cols":27,"rows_kept":36,"cut":false,"hidden":true,"merged":[]}
[1,"赤",null,null,null,null,null,null,null,null,null,null,null,null,null,null,null,null,null,null,null,null,null,null,null,null,"2999-12-31"]
[2,"黒"]
[3,"赤"]
[4,"黒"]
[5,"赤"]
[6,"黒"]
[7,"赤"]
[8,"黒"]
[9,"赤"]
[10,"黒"]
[11,"黒"]
[12,"赤"]
[13,"黒"]
[14,"赤"]
[15,"黒"]
[16,"赤"]
[17,"黒"]
[18,"赤"]
[19,"赤"]
[20,"黒"]
{"$rows_left_out":16}